Oralce 10gR2 Installation CentOS 4.3 Error

Installation and support for Oracle DB on CentOS.
Post Reply
jadba
Posts: 2
Joined: 2006/10/09 04:22:07
Contact:

Oralce 10gR2 Installation CentOS 4.3 Error

Post by jadba » 2006/10/12 05:01:22

Machine is AMD 32bit processor.
I have followed installation guides at OTN and PUSCHITZ.COM and receive the following error message during the installation process;
Error in invoking target 'ntcontab.o' of makefile '/u01/app/oracle/product/10.2.0/db_1/network/lib/ins_net_client_mk'. See '/u01/app/oracle/product/oraInventory/logs/installActions2006-10-08_10-02-05-PM.log' for details.
It then displays the 'Help' 'Retry' 'Ignore' 'Cancel' buttons.

output of 'uname -r': 2.6.9-42.0.3.EL.
Required dependency check output:
$ rpm -q binutils compat-db control-center gcc gcc-c++ glibc glibc-common gnome-libs \
> libstdc++ libstdc++-devel make pdksh sysstat xscreensaver libaio
binutils-2.15.92.0.2-21
compat-db-4.1.25-9
control-center-2.8.0-12.rhel4.5
gcc-3.4.6-3
gcc-c++-3.4.6-3
glibc-2.3.4-2.25
glibc-common-2.3.4-2.25
gnome-libs-1.4.1.2.90-44.1
libstdc++-3.4.6-3
libstdc++-devel-3.4.6-3
make-3.80-6.EL4
pdksh-5.2.14-30.3
sysstat-5.0.5-11.rhel4
xscreensaver-4.18-5.rhel4.11
libaio-0.3.105-2

Not sure what the problem is. Has anyone experienced this or have a solution. TIA.

mariano
Posts: 37
Joined: 2006/02/14 19:45:02
Location: Cordoba, Argentina
Contact:

Oralce 10gR2 Installation CentOS 4.3 Error

Post by mariano » 2006/10/12 20:11:42

Can you post the error message you get in that log (/u01/app/oracle/product/oraInventory/logs/installActions2006-10-08_10-02-05-PM.log)?
I'm checking my last installation log file and I can see that it passed that part without errors.

jadba
Posts: 2
Joined: 2006/10/09 04:22:07
Contact:

Re: Oralce 10gR2 Installation CentOS 4.3 Error

Post by jadba » 2006/10/13 04:26:27

[quote]
mariano wrote:
Can you post the error message you get in that log (/u01/app/oracle/product/oraInventory/logs/installActions2006-10-08_10-02-05-PM.log)?
I'm checking my last installation log file and I can see that it passed that part without errors.[/quote]

Here is the last couple of lines:

INFO: Calling Action unixActions10.2.0.1.0 make
installMakePath = /usr/bin/make
installMakeFileName = /u01/app/oracle/product/10.2.0/db_1/network/lib/ins_net_client.mk
installTarget = ntcontab.o
installArguments = ORACLE_HOME=/u01/app/oracle/product/10.2.0/db_1,
undoMakeFileName = null
undoTarget = null
undoArguments = null
logFile = /u01/app/oracle/product/10.2.0/db_1/install/make.log
progMsg = Linking ntcontab

INFO: The output of this make operation is also available at: '/u01/app/oracle/product/10.2.0/db_1/install/make.log'
INFO:

INFO: Start output from spawned process:
INFO: ----------------------------------
INFO:

INFO: rm -f ntcontab.*

INFO: (if [ "compile" = "compile" ] ; then \
/u01/app/oracle/product/10.2.0/db_1/bin/gennttab > ntcontab.c ;\
/usr/bin/gcc -c ntcontab.c ;\
rm -f /u01/app/oracle/product/10.2.0/db_1/lib/ntcontab.o ;\
mv ntcontab.o /u01/app/oracle/product/10.2.0/db_1/lib/ ;\

INFO: /usr/bin/ar rv /u01/app/oracle/product/10.2.0/db_1/lib/libn10.a /u01/app/oracle/product/10.2.0/db_1/lib/ntcontab.o ; fi)

INFO: In file included from /usr/include/sys/types.h:31
INFO: ,
from ntcontab.c:7
INFO: :

INFO: /usr/include/bits/types.h:31:20:
INFO:
INFO: stddef.h: No such file or directory
INFO:

INFO: In file included from /usr/include/sys/types.h:266,
from ntcontab.c:7:
/usr/include/bits/pthreadtypes.h:48: error: syntax error before "size_t"
INFO:

INFO: /usr/include/bits/pthreadtypes.h:51: error: syntax error before "__stacksize"
INFO:

INFO: mv: cannot stat `ntcontab.o': No such file or directory

INFO: /usr/bin/ar: /u01/app/oracle/product/10.2.0/db_1/lib/ntcontab.o: No such file or directory

INFO: make:
INFO: *** [ntcontab.o] Error 1

INFO: End output from spawned process.
INFO: ----------------------------------
INFO: Exception thrown from action: make
Exception Name: MakefileException
Exception String: Error in invoking target 'ntcontab.o' of makefile '/u01/app/oracle/product/10.2.0/db_1/network/lib/ins_net_client.mk'. See '/u01/app/oracle/oraInventory/logs/installActions2006-10-12_10-36-14PM.log' for details.
Exception Severity: 1

Post Reply

Return to “CentOS 4 - Oracle Installation and Support”